Reaction Details
TargetSodium-dependent noradrenaline transporter
LigandBDBM50383522
Substrate/Competitorn/a
Meas. Tech.ChEMBL_818589 (CHEMBL2032876)
Ki>2000±n/a nM
Citation Mihalic, JTFan, PChen, XChen, XFu, YMotani, ALiang, LLindstrom, MTang, LChen, JLJaen, JDai, KLi, L Discovery of a novel melanin concentrating hormone receptor 1 (MCHR1) antagonist with reduced hERG inhibition. Bioorg Med Chem Lett22:3781-5 (2012) 
 
Sodium-dependent noradrenaline transporter
Name:Sodium-dependent noradrenaline transporter
Type:Multi-pass membrane protein
Mol. Mass.:69337.72
Organism:Homo sapiens (Human)
Description:P23975
Residue:617
BDBM50383522
NameBDBM50383522
Synonyms:CHEMBL2032049
TypeSmall organic molecule
Emp. Form.C26H33F3N2O2
Mol. Mass.462.5476
SMILESC[C@@H]1[C@H]2CN(CCC3(CCCCC3)C(O)=O)CC[C@@H]2Cc2[nH]c3ccc(cc3c12)C(F)(F)F