Reaction Details
TargetPotassium voltage-gated channel subfamily H member 2
LigandBDBM50193857
Substrate/Competitorn/a
Meas. Tech.ChEMBL_818621 (CHEMBL2032908)
Ki>10000±n/a nM
Citation Mihalic, JTFan, PChen, XChen, XFu, YMotani, ALiang, LLindstrom, MTang, LChen, JLJaen, JDai, KLi, L Discovery of a novel melanin concentrating hormone receptor 1 (MCHR1) antagonist with reduced hERG inhibition. Bioorg Med Chem Lett22:3781-5 (2012) 
 
Potassium voltage-gated channel subfamily H member 2
Name:Potassium voltage-gated channel subfamily H member 2
Type:Multi-pass membrane protein
Mol. Mass.:126672.65
Organism:Homo sapiens (Human)
Description:Q12809
Residue:1159
BDBM50193857
NameBDBM50193857
Synonyms:1-({4-[4-chloro-2-(5-chloro-pyridin-2-ylcarbamoyl)-phenylcarbamoyl]-phenyl}-imino-methyl)-piperidine-3-carboxylic acid | CHEMBL218087
TypeSmall organic molecule
Emp. Form.C26H23Cl2N5O4
Mol. Mass.540.398
SMILESOC(=O)C1CCCN(C1)C(=N)c1ccc(cc1)C(=O)Nc1ccc(Cl)cc1C(=O)Nc1ccc(Cl)cn1