Reaction Details
TargetBotulinum neurotoxin type A
LigandBDBM50383550
Substrate/Competitorn/a
Meas. Tech.ChEMBL_818727 (CHEMBL2033254)
IC50 560±n/a nM
Citation Smith, GRCaglic, DCapek, PZhang, YGodbole, SReitz, ABDickerson, TJ Reexamining hydroxamate inhibitors of botulinum neurotoxin serotype A: extending towards theß-exosite. Bioorg Med Chem Lett22:3754-7 (2012) 
 
Botulinum neurotoxin type A
Name:Botulinum neurotoxin type A
Type:PROTEIN
Mol. Mass.:149450.01
Organism:Clostridium botulinum
Description:ChEMBL_1510137
Residue:1296
BDBM50383550
NameBDBM50383550
Synonyms:CHEMBL2032381
TypeSmall organic molecule
Emp. Form.C15H13ClN2O3
Mol. Mass.304.728
SMILESCOc1ccc(cn1)-c1ccc(\C=C\C(=O)NO)c(Cl)c1