Reaction Details
TargetSerine/threonine-protein kinase pim-1
LigandBDBM50383711
Substrate/Competitorn/a
Meas. Tech.ChEMBL_819142 (CHEMBL2034662)
IC50 3.8±n/a nM
Citation Koltun, ESTsuhako, ALBrown, DSAay, NArcalas, AChan, VDu, HEngst, SFerguson, KFranzini, MGalan, AHolst, CRHuang, PKane, BKim, MHLi, JMarkby, DMohan, MNoson, KPlonowski, ARichards, SJRobertson, SShaw, KStott, GStout, TJYoung, JYu, PZaharia, CAZhang, WZhou, PNuss, JMXu, WKearney, PC Discovery of XL413, a potent and selective CDC7 inhibitor. Bioorg Med Chem Lett22:3727-31 (2012) 
 
Serine/threonine-protein kinase pim-1
Name:Serine/threonine-protein kinase pim-1
Type:Protein
Mol. Mass.:35681.82
Organism:Homo sapiens (Human)
Description:P11309
Residue:313
BDBM50383711
NameBDBM50383711
Synonyms:CHEMBL2030387
TypeSmall organic molecule
Emp. Form.C15H15BrN4O2
Mol. Mass.363.209
SMILESN[C@H]1CCN(Cc2nc3c4cc(Br)ccc4oc3c(=O)[nH]2)C1