Reaction Details
TargetCell division cycle 7-related protein kinase
LigandBDBM50383730
Substrate/Competitorn/a
Meas. Tech.ChEMBL_819140 (CHEMBL2034660)
IC50 4.8±n/a nM
Citation Koltun, ESTsuhako, ALBrown, DSAay, NArcalas, AChan, VDu, HEngst, SFerguson, KFranzini, MGalan, AHolst, CRHuang, PKane, BKim, MHLi, JMarkby, DMohan, MNoson, KPlonowski, ARichards, SJRobertson, SShaw, KStott, GStout, TJYoung, JYu, PZaharia, CAZhang, WZhou, PNuss, JMXu, WKearney, PC Discovery of XL413, a potent and selective CDC7 inhibitor. Bioorg Med Chem Lett22:3727-31 (2012) 
 
Cell division cycle 7-related protein kinase
Name:Cell division cycle 7-related protein kinase
Type:Protein
Mol. Mass.:63908.16
Organism:Homo sapiens (Human)
Description:O00311
Residue:574
BDBM50383730
NameBDBM50383730
Synonyms:CHEMBL2030393
TypeSmall organic molecule
Emp. Form.C14H12BrN3O2
Mol. Mass.334.168
SMILESBrc1ccc2oc3c(nc([nH]c3=O)[C@@H]3CCCN3)c2c1