Reaction Details
TargetCell division cycle 7-related protein kinase
LigandBDBM50383736
Substrate/Competitorn/a
Meas. Tech.ChEMBL_819140 (CHEMBL2034660)
IC50 3.7±n/a nM
Citation Koltun, ESTsuhako, ALBrown, DSAay, NArcalas, AChan, VDu, HEngst, SFerguson, KFranzini, MGalan, AHolst, CRHuang, PKane, BKim, MHLi, JMarkby, DMohan, MNoson, KPlonowski, ARichards, SJRobertson, SShaw, KStott, GStout, TJYoung, JYu, PZaharia, CAZhang, WZhou, PNuss, JMXu, WKearney, PC Discovery of XL413, a potent and selective CDC7 inhibitor. Bioorg Med Chem Lett22:3727-31 (2012) 
 
Cell division cycle 7-related protein kinase
Name:Cell division cycle 7-related protein kinase
Type:Protein
Mol. Mass.:63908.16
Organism:Homo sapiens (Human)
Description:O00311
Residue:574
BDBM50383736
NameBDBM50383736
Synonyms:CHEMBL2030400
TypeSmall organic molecule
Emp. Form.C14H11BrFN3O2
Mol. Mass.352.158
SMILESF[C@H]1CN[C@@H](C1)c1nc2c3cc(Br)ccc3oc2c(=O)[nH]1