Reaction Details
TargetVoltage-dependent N-type calcium channel subunit alpha-1B
LigandBDBM50383773
Substrate/Competitorn/a
Meas. Tech.ChEMBL_819282 (CHEMBL2032639)
IC50 1100±n/a nM
Citation Yamamoto, TNiwa, STokumasu, MOnishi, TOhno, SHagihara, MKoganei, HFujita, STakeda, TSaitou, YIwayama, STakahara, AIwata, SShoji, M Discovery and evaluation of selective N-type calcium channel blockers: 6-unsubstituted-1,4-dihydropyridine-5-carboxylic acid derivatives. Bioorg Med Chem Lett22:3639-42 (2012) 
 
Voltage-dependent N-type calcium channel subunit alpha-1B
Name:Voltage-dependent N-type calcium channel subunit alpha-1B
Type:Enzyme
Mol. Mass.:262548.16
Organism:Homo sapiens (Human)
Description:Q00975
Residue:2339
BDBM50383773
NameBDBM50383773
Synonyms:CHEMBL2030591
TypeSmall organic molecule
Emp. Form.C25H24ClNO6
Mol. Mass.469.914
SMILESCOC(OC)C1=C(C(C(C=N1)C(O)=O)c1cccc(Cl)c1)C(=O)OC\C=C\c1ccccc1