Reaction Details
TargetAurora kinase A
LigandBDBM50383813
Substrate/Competitorn/a
Meas. Tech.ChEMBL_819407 (CHEMBL2033074)
IC50 3570±n/a nM
Citation Li, XLu, XXing, MYang, XHZhao, TTGong, HBZhu, HL Synthesis, biological evaluation, and molecular docking studies of N,1,3-triphenyl-1H-pyrazole-4-carboxamide derivatives as anticancer agents. Bioorg Med Chem Lett22:3589-93 (2012) 
 
Aurora kinase A
Name:Aurora kinase A
Type:Serine/threonine-protein kinase
Mol. Mass.:45830.98
Organism:Homo sapiens (Human)
Description:O14965
Residue:403
BDBM50383813
NameBDBM50383813
Synonyms:CHEMBL2030971
TypeSmall organic molecule
Emp. Form.C22H16ClN3O
Mol. Mass.373.835
SMILESClc1ccc(NC(=O)c2cn(nc2-c2ccccc2)-c2ccccc2)cc1