Reaction Details
TargetPeptide deformylase
LigandBDBM50383971
Substrate/Competitorn/a
Meas. Tech.ChEMBL_819737 (CHEMBL2034167)
IC50 0.77±n/a nM
Citation Axten, JMMedina, JRBlackledge, CWDuquenne, CGrant, SWBobko, MAPeng, TMiller, WHPinckney, TGallagher, TFKulkarni, SLewandowski, TVan Aller, GSZonis, RWard, PCampobasso, N Acylprolinamides: a new class of peptide deformylase inhibitors with in vivo antibacterial activity. Bioorg Med Chem Lett22:4028-32 (2012) 
 
Peptide deformylase
Name:Peptide deformylase
Type:PROTEIN
Mol. Mass.:22668.24
Organism:Streptococcus pneumoniae serotype 4 (strain ATCC BAA-334 / TIGR4)
Description:ChEMBL_819737
Residue:203
BDBM50383971
NameBDBM50383971
Synonyms:CHEMBL2032145
TypeSmall organic molecule
Emp. Form.C19H32N4O6
Mol. Mass.412.4806
SMILESOCCCNC(=O)NC(=O)[C@@H]1CCCN1C(=O)[C@H](CC1CCCC1)CN(O)C=O