Reaction Details
TargetPeptide deformylase
LigandBDBM50383992
Substrate/Competitorn/a
Meas. Tech.ChEMBL_819736 (CHEMBL2034166)
IC50 2±n/a nM
Citation Axten, JMMedina, JRBlackledge, CWDuquenne, CGrant, SWBobko, MAPeng, TMiller, WHPinckney, TGallagher, TFKulkarni, SLewandowski, TVan Aller, GSZonis, RWard, PCampobasso, N Acylprolinamides: a new class of peptide deformylase inhibitors with in vivo antibacterial activity. Bioorg Med Chem Lett22:4028-32 (2012) 
 
Peptide deformylase
Name:Peptide deformylase
Type:Enzyme
Mol. Mass.:20556.80
Organism:Staphylococcus aureus
Description:P68825
Residue:183
BDBM50383992
NameBDBM50383992
Synonyms:CHEMBL2032130
TypeSmall organic molecule
Emp. Form.C18H30N4O5
Mol. Mass.382.4546
SMILESCCNC(=O)NC(=O)[C@@H]1CCCN1C(=O)[C@H](CC1CCCC1)CN(O)C=O