Reaction Details
TargetHepatocyte growth factor receptor
LigandBDBM50384011
Substrate/Competitorn/a
Meas. Tech.ChEMBL_819757 (CHEMBL2034187)
IC50 90±n/a nM
Citation Lee, JHan, SYJung, HYang, JChoi, JWChae, CHPark, CHChoi, SULee, KHa, JDLee, CORyu, JWKim, HRKoh, JSCho, SY Synthesis and structure-activity relationship of aminopyridines with substituted benzoxazoles as c-Met kinase inhibitors. Bioorg Med Chem Lett22:4044-8 (2012) 
 
Hepatocyte growth factor receptor
Name:Hepatocyte growth factor receptor
Type:Protein
Mol. Mass.:155559.73
Organism:Homo sapiens (Human)
Description:P08581
Residue:1390
BDBM50384011
NameBDBM50384011
Synonyms:CHEMBL2032293
TypeSmall organic molecule
Emp. Form.C22H23FN6O2
Mol. Mass.422.4554
SMILESNc1ncc(cc1-c1nc2ccc(F)cc2o1)-c1cnn(c1)C1CCN(CCO)CC1