Reaction Details
TargetHepatocyte growth factor receptor
LigandBDBM50384027
Substrate/Competitorn/a
Meas. Tech.ChEMBL_819757 (CHEMBL2034187)
IC50 3±n/a nM
Citation Lee, JHan, SYJung, HYang, JChoi, JWChae, CHPark, CHChoi, SULee, KHa, JDLee, CORyu, JWKim, HRKoh, JSCho, SY Synthesis and structure-activity relationship of aminopyridines with substituted benzoxazoles as c-Met kinase inhibitors. Bioorg Med Chem Lett22:4044-8 (2012) 
 
Hepatocyte growth factor receptor
Name:Hepatocyte growth factor receptor
Type:Protein
Mol. Mass.:155559.73
Organism:Homo sapiens (Human)
Description:P08581
Residue:1390
BDBM50384027
NameBDBM50384027
Synonyms:CHEMBL2032277
TypeSmall organic molecule
Emp. Form.C22H24N6O2
Mol. Mass.404.465
SMILESCc1cc2oc(nc2c(C)c1O)-c1cc(cnc1N)-c1cnn(c1)C1CCNCC1