Reaction Details
TargetSphingosine 1-phosphate receptor 3
LigandBDBM50420018
Substrate/Competitorn/a
Meas. Tech.ChEMBL_819768 (CHEMBL2034280)
EC50>10000±n/a nM
Citation Deng, GMeng, QLiu, QXu, XXu, QRen, FGuo, TBLu, HXiang, JNElliott, JDLin, X Identification of benzoxazole analogs as novel, S1P(3) sparing S1P(1) agonists. Bioorg Med Chem Lett22:3973-7 (2012) 
 
Sphingosine 1-phosphate receptor 3
Name:Sphingosine 1-phosphate receptor 3
Type:G Protein-Coupled Receptor (GPCR)
Mol. Mass.:42278.13
Organism:Homo sapiens (Human)
Description:Q99500
Residue:378
BDBM50420018
NameBDBM50420018
Synonyms:CHEMBL2032310
TypeSmall organic molecule
Emp. Form.C21H22F3N3O4
Mol. Mass.437.4123
SMILESCC(C)Oc1ncc(cc1C(F)(F)F)-c1nc2cc(CCCCCC(O)=O)cnc2o1