Reaction Details
TargetSphingosine 1-phosphate receptor 3
LigandBDBM50420020
Substrate/Competitorn/a
Meas. Tech.ChEMBL_819768 (CHEMBL2034280)
EC50>10000±n/a nM
Citation Deng, GMeng, QLiu, QXu, XXu, QRen, FGuo, TBLu, HXiang, JNElliott, JDLin, X Identification of benzoxazole analogs as novel, S1P(3) sparing S1P(1) agonists. Bioorg Med Chem Lett22:3973-7 (2012) 
 
Sphingosine 1-phosphate receptor 3
Name:Sphingosine 1-phosphate receptor 3
Type:G Protein-Coupled Receptor (GPCR)
Mol. Mass.:42278.13
Organism:Homo sapiens (Human)
Description:Q99500
Residue:378
BDBM50420020
NameBDBM50420020
Synonyms:CHEMBL2032312
TypeSmall organic molecule
Emp. Form.C23H19F3N2O3S
Mol. Mass.460.469
SMILESOC(=O)CCCCCc1cnc2oc(nc2c1)-c1cc(c(s1)C(F)(F)F)-c1ccccc1