Reaction Details
TargetSphingosine 1-phosphate receptor 1
LigandBDBM50420017
Substrate/Competitorn/a
Meas. Tech.ChEMBL_819767 (CHEMBL2034279)
EC50 19.95±n/a nM
Citation Deng, GMeng, QLiu, QXu, XXu, QRen, FGuo, TBLu, HXiang, JNElliott, JDLin, X Identification of benzoxazole analogs as novel, S1P(3) sparing S1P(1) agonists. Bioorg Med Chem Lett22:3973-7 (2012) 
 
Sphingosine 1-phosphate receptor 1
Name:Sphingosine 1-phosphate receptor 1
Type:Enzyme
Mol. Mass.:42836.02
Organism:Homo sapiens (Human)
Description:P21453
Residue:382
BDBM50420017
NameBDBM50420017
Synonyms:CHEMBL2032309
TypeSmall organic molecule
Emp. Form.C22H23F3N2O4
Mol. Mass.436.4242
SMILESCC(C)Oc1ccc(cc1C(F)(F)F)-c1nc2cc(CCCCCC(O)=O)cnc2o1