Reaction Details
TargetMembrane primary amine oxidase
LigandBDBM50384084
Substrate/Competitorn/a
Meas. Tech.ChEMBL_819788 (CHEMBL2034300)
IC50 10±n/a nM
Citation Foot, JSDeodhar, MTurner, CIYin, Pvan Dam, EMSilva, DGOlivieri, AHolt, AMcDonald, IA The discovery and development of selective 3-fluoro-4-aryloxyallylamine inhibitors of the amine oxidase activity of semicarbazide-sensitive amine oxidase/vascular adhesion protein-1 (SSAO/VAP-1). Bioorg Med Chem Lett22:3935-40 (2012) 
 
Membrane primary amine oxidase
Name:Membrane primary amine oxidase
Type:Protein
Mol. Mass.:84620.86
Organism:Homo sapiens (Human)
Description:Q16853
Residue:763
BDBM50384084
NameBDBM50384084
Synonyms:CHEMBL2029546
TypeSmall organic molecule
Emp. Form.C17H23FN2O2
Mol. Mass.306.3751
SMILESNC\C=C(\F)COc1ccc(cc1)C(=O)NC1CCCCC1