Reaction Details
TargetCannabinoid receptor 1
LigandBDBM50384159
Substrate/Competitorn/a
Meas. Tech.ChEMBL_820022 (CHEMBL2032795)
EC50 51.4±n/a nM
Citation Wei, ZYang, HLiu, ZTremblay, MJohnstone, SBéha, SYue, SYSrivastava, STomaszewski, MJBrown, WWalpole, CSt-Onge, SLessard, EArchambault, AJGroblewski, TPagé, D N-Methyl-3-(tetrahydro-2H-pyran-4-yl)-2,3,4,9-tetrahydro-1H-carbazole-6-carboxamides as a novel class of cannabinoid receptors agonists with low CNS penetration. Bioorg Med Chem Lett22:3884-9 (2012) 
 
Cannabinoid receptor 1
Name:Cannabinoid receptor 1
Type:G Protein-Coupled Receptor (GPCR)
Mol. Mass.:52868.96
Organism:Homo sapiens (Human)
Description:P21554
Residue:472
BDBM50384159
NameBDBM50384159
Synonyms:CHEMBL2029729
TypeSmall organic molecule
Emp. Form.C25H35N3O3
Mol. Mass.425.5637
SMILESCNC(=O)CCCN(C)C(=O)c1ccc2n(C)c3CC[C@H](Cc3c2c1)C1CCOCC1