Reaction Details
TargetAurora kinase A
LigandBDBM50384177
Substrate/Competitorn/a
Meas. Tech.ChEMBL_820048 (CHEMBL2032821)
IC50 11±n/a nM
Citation Le Brazidec, JYPasis, ATam, BBoykin, CWang, DMarcotte, DJClaassen, GChong, JHChao, JFan, JNguyen, KSilvian, LLing, LZhang, LChoi, MTeng, MPathan, NZhao, SLi, TTaveras, A Structure-based design of 2,6,7-trisubstituted-7H-pyrrolo[2,3-d]pyrimidines as Aurora kinases inhibitors. Bioorg Med Chem Lett22:4033-7 (2012) 
 
Aurora kinase A
Name:Aurora kinase A
Type:Serine/threonine-protein kinase
Mol. Mass.:45830.98
Organism:Homo sapiens (Human)
Description:O14965
Residue:403
BDBM50384177
NameBDBM50384177
Synonyms:CHEMBL2029905
TypeSmall organic molecule
Emp. Form.C24H33N7O2
Mol. Mass.451.5645
SMILESCC(O)c1cc2cnc(Nc3cc(C(=O)N4CCN(C)CC4)n(C)c3)nc2n1C1CCCC1