Reaction Details
TargetAurora kinase A
LigandBDBM50384168
Substrate/Competitorn/a
Meas. Tech.ChEMBL_820048 (CHEMBL2032821)
IC50 2±n/a nM
Citation Le Brazidec, JYPasis, ATam, BBoykin, CWang, DMarcotte, DJClaassen, GChong, JHChao, JFan, JNguyen, KSilvian, LLing, LZhang, LChoi, MTeng, MPathan, NZhao, SLi, TTaveras, A Structure-based design of 2,6,7-trisubstituted-7H-pyrrolo[2,3-d]pyrimidines as Aurora kinases inhibitors. Bioorg Med Chem Lett22:4033-7 (2012) 
 
Aurora kinase A
Name:Aurora kinase A
Type:Serine/threonine-protein kinase
Mol. Mass.:45830.98
Organism:Homo sapiens (Human)
Description:O14965
Residue:403
BDBM50384168
NameBDBM50384168
Synonyms:CHEMBL2029911
TypeSmall organic molecule
Emp. Form.C27H35N9O
Mol. Mass.501.6265
SMILESCN1CCN(CC1)C(=O)c1cc(Nc2ncc3cc(-c4cnn(C)c4C)n(C4CCCC4)c3n2)cn1C