Reaction Details
TargetPhosphatidylinositol 4,5-bisphosphate 3-kinase catalytic subunit alpha isoform
LigandBDBM50384253
Substrate/Competitorn/a
Meas. Tech.ChEMBL_820241 (CHEMBL2033328)
IC50 1060±n/a nM
Citation Finlay, MRButtar, DCritchlow, SEDishington, APFillery, SMFisher, EGlossop, SCGraham, MAJohnson, TLamont, GMMutton, SPerkins, PPike, KGSlater, AM Sulfonyl-morpholino-pyrimidines: SAR and development of a novel class of selective mTOR kinase inhibitor. Bioorg Med Chem Lett22:4163-8 (2012) 
 
Phosphatidylinositol 4,5-bisphosphate 3-kinase catalytic subunit alpha isoform
Name:Phosphatidylinositol 4,5-bisphosphate 3-kinase catalytic subunit alpha isoform
Type:Enzyme Subunit
Mol. Mass.:124294.87
Organism:Homo sapiens (Human)
Description:P42336
Residue:1068
BDBM50384253
NameBDBM50384253
Synonyms:CHEMBL2030445
TypeSmall organic molecule
Emp. Form.C17H19N5O3S
Mol. Mass.373.429
SMILESCS(=O)(=O)Cc1cc(nc(n1)-c1ccc2nc[nH]c2c1)N1CCOCC1