Reaction Details
TargetSerine/threonine-protein kinase mTOR
LigandBDBM50384248
Substrate/Competitorn/a
Meas. Tech.ChEMBL_820240 (CHEMBL2033327)
IC50 28±n/a nM
Citation Finlay, MRButtar, DCritchlow, SEDishington, APFillery, SMFisher, EGlossop, SCGraham, MAJohnson, TLamont, GMMutton, SPerkins, PPike, KGSlater, AM Sulfonyl-morpholino-pyrimidines: SAR and development of a novel class of selective mTOR kinase inhibitor. Bioorg Med Chem Lett22:4163-8 (2012) 
 
Serine/threonine-protein kinase mTOR
Name:Serine/threonine-protein kinase mTOR
Type:Rapamycin target protein
Mol. Mass.:288917.12
Organism:Homo sapiens (Human)
Description:P42345
Residue:2549
BDBM50384248
NameBDBM50384248
Synonyms:CHEMBL2030451
TypeSmall organic molecule
Emp. Form.C23H24FN5O4S
Mol. Mass.485.531
SMILESCS(=O)(=O)Cc1cc(nc(n1)-c1ccc(NC(=O)Nc2ccc(F)cc2)cc1)N1CCOCC1