Reaction Details
TargetSerine/threonine-protein kinase mTOR
LigandBDBM50384261
Substrate/Competitorn/a
Meas. Tech.ChEMBL_820240 (CHEMBL2033327)
IC50 1380±n/a nM
Citation Finlay, MRButtar, DCritchlow, SEDishington, APFillery, SMFisher, EGlossop, SCGraham, MAJohnson, TLamont, GMMutton, SPerkins, PPike, KGSlater, AM Sulfonyl-morpholino-pyrimidines: SAR and development of a novel class of selective mTOR kinase inhibitor. Bioorg Med Chem Lett22:4163-8 (2012) 
 
Serine/threonine-protein kinase mTOR
Name:Serine/threonine-protein kinase mTOR
Type:Rapamycin target protein
Mol. Mass.:288917.12
Organism:Homo sapiens (Human)
Description:P42345
Residue:2549
BDBM50384261
NameBDBM50384261
Synonyms:CHEMBL2030439
TypeSmall organic molecule
Emp. Form.C20H19FN4O3S
Mol. Mass.414.453
SMILESFc1ccc(cc1)S(=O)(=O)Cc1cc(nc(n1)-c1ccccn1)N1CCOCC1