Reaction Details
TargetSerine/threonine-protein kinase mTOR
LigandBDBM50384255
Substrate/Competitorn/a
Meas. Tech.ChEMBL_820240 (CHEMBL2033327)
IC50 1410±n/a nM
Citation Finlay, MRButtar, DCritchlow, SEDishington, APFillery, SMFisher, EGlossop, SCGraham, MAJohnson, TLamont, GMMutton, SPerkins, PPike, KGSlater, AM Sulfonyl-morpholino-pyrimidines: SAR and development of a novel class of selective mTOR kinase inhibitor. Bioorg Med Chem Lett22:4163-8 (2012) 
 
Serine/threonine-protein kinase mTOR
Name:Serine/threonine-protein kinase mTOR
Type:Rapamycin target protein
Mol. Mass.:288917.12
Organism:Homo sapiens (Human)
Description:P42345
Residue:2549
BDBM50384255
NameBDBM50384255
Synonyms:CHEMBL1312643
TypeSmall organic molecule
Emp. Form.C20H20N4O3S
Mol. Mass.396.463
SMILESO=S(=O)(Cc1cc(nc(n1)-c1ccccn1)N1CCOCC1)c1ccccc1