Reaction Details
TargetRap guanine nucleotide exchange factor 4
LigandBDBM50384265
Substrate/Competitorn/a
Meas. Tech.ChEMBL_820257 (CHEMBL2033344)
IC50 8400±n/a nM
Citation Chen, HTsalkova, TMei, FCHu, YCheng, XZhou, J 5-Cyano-6-oxo-1,6-dihydro-pyrimidines as potent antagonists targeting exchange proteins directly activated by cAMP. Bioorg Med Chem Lett22:4038-43 (2012) 
 
Rap guanine nucleotide exchange factor 4
Name:Rap guanine nucleotide exchange factor 4
Type:PROTEIN
Mol. Mass.:115526.83
Organism:Homo sapiens (Human)
Description:ChEMBL_1504794
Residue:1011
BDBM50384265
NameBDBM50384265
Synonyms:CHEMBL2030452
TypeSmall organic molecule
Emp. Form.C20H23N3OS
Mol. Mass.353.481
SMILESCc1ccc(C)c(CSc2nc(C3CCCCC3)c(C#N)c(=O)[nH]2)c1