Reaction Details
TargetRap guanine nucleotide exchange factor 4
LigandBDBM50384266
Substrate/Competitorn/a
Meas. Tech.ChEMBL_820257 (CHEMBL2033344)
IC50>300000±n/a nM
Citation Chen, HTsalkova, TMei, FCHu, YCheng, XZhou, J 5-Cyano-6-oxo-1,6-dihydro-pyrimidines as potent antagonists targeting exchange proteins directly activated by cAMP. Bioorg Med Chem Lett22:4038-43 (2012) 
 
Rap guanine nucleotide exchange factor 4
Name:Rap guanine nucleotide exchange factor 4
Type:PROTEIN
Mol. Mass.:115526.83
Organism:Homo sapiens (Human)
Description:ChEMBL_1504794
Residue:1011
BDBM50384266
NameBDBM50384266
Synonyms:CHEMBL2030605
TypeSmall organic molecule
Emp. Form.C11H13N3OS
Mol. Mass.235.305
SMILESO=c1[nH]c(=S)[nH]c(C2CCCCC2)c1C#N