Reaction Details
TargetSolute carrier family 12 member 5
LigandBDBM50315350
Substrate/Competitorn/a
Meas. Tech.ChEMBL_818163 (CHEMBL2033940)
IC50 800±n/a nM
Citation Lebon, FPégurier, CLedecq, MMathieu, BBosman, NFrycia, ALengelé, SDhurke, KKanduluru, AKMeunier, SWagner, AWolff, CProvins, L Towards a KCC2 blocker pharmacophore model. Bioorg Med Chem Lett22:3978-82 (2012) 
 
Solute carrier family 12 member 5
Name:Solute carrier family 12 member 5
Type:PROTEIN
Mol. Mass.:126249.28
Organism:Rattus norvegicus
Description:ChEMBL_818163
Residue:1139
BDBM50315350
NameBDBM50315350
Synonyms:(+)-benzyl 1-acetyl-2-benzylpyrrolidine-2-carboxylate (-)-benzyl 1-acetyl-2-benzylpyrrolidine-2-carboxylate | CHEMBL1091718
TypeSmall organic molecule
Emp. Form.C21H23NO3
Mol. Mass.337.4122
SMILESCC(=O)N1CCCC1(Cc1ccccc1)C(=O)OCc1ccccc1