Reaction Details
TargetApoptosis regulator Bcl-2
LigandBDBM50384324
Substrate/Competitorn/a
Meas. Tech.ChEMBL_818165 (CHEMBL2033942)
IC50 11±n/a nM
Citation Schroeder, GMWei, DBanfi, PCai, ZWLippy, JMenichincheri, MModugno, MNaglich, JPenhallow, BPerez, HLSack, JSchmidt, RJTebben, AYan, CZhang, LGalvani, ALombardo, LJBorzilleri, RM Pyrazole and pyrimidine phenylacylsulfonamides as dual Bcl-2/Bcl-xL antagonists. Bioorg Med Chem Lett22:3951-6 (2012) 
 
Apoptosis regulator Bcl-2
Name:Apoptosis regulator Bcl-2
Type:Homodimer or heterodimer
Mol. Mass.:26269.11
Organism:Homo sapiens (Human)
Description:P10415
Residue:239
BDBM50384324
NameBDBM50384324
Synonyms:CHEMBL2030859 | US9346795, 260
TypeSmall organic molecule
Emp. Form.C42H40N4O6S
Mol. Mass.728.855
SMILESCCCCc1c(c(CO)nn1-c1ccccc1)-c1ccc(cc1C(=O)N1Cc2ccccc2C[C@H]1CO)C(=O)NS(=O)(=O)c1ccc2ccccc2c1