Reaction Details
TargetApoptosis regulator Bcl-2
LigandBDBM50384353
Substrate/Competitorn/a
Meas. Tech.ChEMBL_818176 (CHEMBL2033953)
IC50 16±n/a nM
Citation Perez, HLBanfi, PBertrand, JCai, ZWGrebinski, JWKim, KLippy, JModugno, MNaglich, JSchmidt, RJTebben, AVianello, PWei, DDZhang, LGalvani, ALombardo, LJBorzilleri, RM Identification of a phenylacylsulfonamide series of dual Bcl-2/Bcl-xL antagonists. Bioorg Med Chem Lett22:3946-50 (2012) 
 
Apoptosis regulator Bcl-2
Name:Apoptosis regulator Bcl-2
Type:Homodimer or heterodimer
Mol. Mass.:26269.11
Organism:Homo sapiens (Human)
Description:P10415
Residue:239
BDBM50384353
NameBDBM50384353
Synonyms:CHEMBL2031022 | US9346795, 59
TypeSmall organic molecule
Emp. Form.C45H47Cl3N6O5S
Mol. Mass.890.316
SMILESCCCCN(CCCC)C(=O)c1nn(c(C)c1Cl)-c1ccc(cc1C(=O)N1CCc2ccccc2C1)C(=O)NS(=O)(=O)c1ccc2N(Cc3ccc(Cl)c(Cl)c3)CCc2c1