Reaction Details
TargetOrexin/Hypocretin receptor type 1
LigandBDBM50384423
Substrate/Competitorn/a
Meas. Tech.ChEMBL_818372 (CHEMBL2034509)
IC50 0.8±n/a nM
Citation Jiang, RSong, XBali, PSmith, ABayona, CRLin, LCameron, MDMcDonald, PHKenny, PJKamenecka, TM Disubstituted piperidines as potent orexin (hypocretin) receptor antagonists. Bioorg Med Chem Lett22:3890-4 (2012) 
 
Orexin/Hypocretin receptor type 1
Name:Orexin/Hypocretin receptor type 1
Type:Protein
Mol. Mass.:47554.50
Organism:Homo sapiens (Human)
Description:O43613
Residue:425
BDBM50384423
NameBDBM50384423
Synonyms:CHEMBL2031485 | US9896452, Example 62
TypeSmall organic molecule
Emp. Form.C27H27N3O3S
Mol. Mass.473.587
SMILESC[C@@H]1CCCN([C@@H]1CNC(=O)c1cccc2occc12)C(=O)c1nc(C)sc1-c1ccccc1