Reaction Details
TargetOrexin receptor type 2
LigandBDBM50384417
Substrate/Competitorn/a
Meas. Tech.ChEMBL_818373 (CHEMBL2034510)
IC50 2±n/a nM
Citation Jiang, RSong, XBali, PSmith, ABayona, CRLin, LCameron, MDMcDonald, PHKenny, PJKamenecka, TM Disubstituted piperidines as potent orexin (hypocretin) receptor antagonists. Bioorg Med Chem Lett22:3890-4 (2012) 
 
Orexin receptor type 2
Name:Orexin receptor type 2
Type:Protein
Mol. Mass.:50710.53
Organism:Homo sapiens (Human)
Description:O43614
Residue:444
BDBM50384417
NameBDBM50384417
Synonyms:CHEMBL2031478
TypeSmall organic molecule
Emp. Form.C29H27N3O2
Mol. Mass.449.5436
SMILESO=C(NCC1CCCCN1C(=O)c1ccccc1-c1ccccc1)c1cccc2cccnc12