Reaction Details
TargetProstaglandin E2 receptor EP3 subtype
LigandBDBM50384445
Substrate/Competitorn/a
Meas. Tech.ChEMBL_821761 (CHEMBL2039058)
Ki 7.94±n/a nM
Citation Jin, JMorales-Ramos, AEidam, PMecom, JLi, YBrooks, CHilfiker, MZhang, DWang, NShi, DTseng, PSWheless, KBudzik, BEvans, KJaworski, JPJugus, JLeon, LWu, CPullen, MKaramshi, BRao, PWard, ELaping, NEvans, CLeach, CHolt, DSu, XMorrow, DFries, HThorneloe, KEdwards, R Novel 3-Oxazolidinedione-6-aryl-pyridinones as Potent, Selective, and Orally Active EP3 Receptor Antagonists. ACS Med Chem Lett1:316-320 (2010) 
 
Prostaglandin E2 receptor EP3 subtype
Name:Prostaglandin E2 receptor EP3 subtype
Type:Enzyme Catalytic Domain
Mol. Mass.:39958.37
Organism:RAT
Description:Prostaglandin E2 PTGER2 RAT::P34980
Residue:365
BDBM50384445
NameBDBM50384445
Synonyms:CHEMBL2035508
TypeSmall organic molecule
Emp. Form.C20H19N3O4
Mol. Mass.365.3826
SMILESCC(C)C1(OC(=O)NC1=O)c1ccc([nH]c1=O)-c1ccc2n(C)ccc2c1