Reaction Details
TargetProtein-S-isoprenylcysteine O-methyltransferase
LigandBDBM50384449
Substrate/Competitorn/a
Meas. Tech.ChEMBL_821764 (CHEMBL2039061)
IC50 800±n/a nM
Citation Bergman, JAHahne, KSong, JHrycyna, CAGibbs, RA S-Farnesyl-Thiopropionic Acid (FTPA) Triazoles as Potent Inhibitors of Isoprenylcysteine Carboxyl Methyltransferase. ACS Med Chem Lett3:15-19 (2012) 
 
Protein-S-isoprenylcysteine O-methyltransferase
Name:Protein-S-isoprenylcysteine O-methyltransferase
Type:PROTEIN
Mol. Mass.:31943.26
Organism:Homo sapiens (Human)
Description:ChEMBL_956034
Residue:284
BDBM50384449
NameBDBM50384449
Synonyms:CHEMBL2035530
TypeSmall organic molecule
Emp. Form.C26H31N3O2S
Mol. Mass.449.608
SMILESCOC(=O)CCSC\C=C(/C)CCn1cc(CCc2ccc(cc2)-c2ccccc2)nn1