Reaction Details
TargetCytochrome P450 2C8
LigandBDBM50384470
Substrate/Competitorn/a
Meas. Tech.ChEMBL_821903 (CHEMBL2039549)
IC50 470±n/a nM
Citation Crosignani, SJorand-Lebrun, CCampbell, GPrêtre, AGrippi-Vallotton, TQuattropani, ABouscary-Desforges, GBombrun, AMissotten, MHumbert, YFrémaux, CPâquet, MEl Harkani, KBradshaw, CGCleva, CAbla, NDaff, HSchott, OPittet, PAArrighi, JFGaudet, MJohnson, Z Discovery of a Novel Series of CRTH2 (DP2) Receptor Antagonists Devoid of Carboxylic Acids. ACS Med Chem Lett2:938-942 (2011) 
 
Cytochrome P450 2C8
Name:Cytochrome P450 2C8
Type:Protein
Mol. Mass.:55839.23
Organism:Homo sapiens (Human)
Description:P10632
Residue:490
BDBM50384470
NameBDBM50384470
Synonyms:CHEMBL2036030
TypeSmall organic molecule
Emp. Form.C20H22FN5O2
Mol. Mass.383.4194
SMILESCCC(=O)N(Cc1cccc(OC(C)C)c1)c1cc(F)cc(c1)-c1nnn[nH]1