Reaction Details
TargetCytochrome P450 2C8
LigandBDBM50384474
Substrate/Competitorn/a
Meas. Tech.ChEMBL_821903 (CHEMBL2039549)
IC50 220±n/a nM
Citation Crosignani, SJorand-Lebrun, CCampbell, GPrêtre, AGrippi-Vallotton, TQuattropani, ABouscary-Desforges, GBombrun, AMissotten, MHumbert, YFrémaux, CPâquet, MEl Harkani, KBradshaw, CGCleva, CAbla, NDaff, HSchott, OPittet, PAArrighi, JFGaudet, MJohnson, Z Discovery of a Novel Series of CRTH2 (DP2) Receptor Antagonists Devoid of Carboxylic Acids. ACS Med Chem Lett2:938-942 (2011) 
 
Cytochrome P450 2C8
Name:Cytochrome P450 2C8
Type:Protein
Mol. Mass.:55839.23
Organism:Homo sapiens (Human)
Description:P10632
Residue:490
BDBM50384474
NameBDBM50384474
Synonyms:CHEMBL2036223
TypeSmall organic molecule
Emp. Form.C21H22FN5O3S
Mol. Mass.443.494
SMILESCS(=O)(=O)c1ccc(CN(C(=O)C2CCCC2)c2cc(F)cc(c2)-c2nnn[nH]2)cc1