Reaction Details
TargetProstaglandin D2 receptor 2
LigandBDBM50384515
Substrate/Competitorn/a
Meas. Tech.ChEMBL_821892 (CHEMBL2039538)
Ki 2.2±n/a nM
Citation Crosignani, SJorand-Lebrun, CCampbell, GPrêtre, AGrippi-Vallotton, TQuattropani, ABouscary-Desforges, GBombrun, AMissotten, MHumbert, YFrémaux, CPâquet, MEl Harkani, KBradshaw, CGCleva, CAbla, NDaff, HSchott, OPittet, PAArrighi, JFGaudet, MJohnson, Z Discovery of a Novel Series of CRTH2 (DP2) Receptor Antagonists Devoid of Carboxylic Acids. ACS Med Chem Lett2:938-942 (2011) 
 
Prostaglandin D2 receptor 2
Name:Prostaglandin D2 receptor 2
Type:Enzyme
Mol. Mass.:43295.45
Organism:Homo sapiens (Human)
Description:Q9Y5Y4
Residue:395
BDBM50384515
NameBDBM50384515
Synonyms:CHEMBL2036224
TypeSmall organic molecule
Emp. Form.C22H18FN5O3S
Mol. Mass.451.473
SMILESCS(=O)(=O)c1ccc(CN(C(=O)c2ccccc2)c2cc(F)cc(c2)-c2nnn[nH]2)cc1