Reaction Details
TargetProstaglandin D2 receptor 2
LigandBDBM50384516
Substrate/Competitorn/a
Meas. Tech.ChEMBL_821892 (CHEMBL2039538)
Ki 2.5±n/a nM
Citation Crosignani, SJorand-Lebrun, CCampbell, GPrêtre, AGrippi-Vallotton, TQuattropani, ABouscary-Desforges, GBombrun, AMissotten, MHumbert, YFrémaux, CPâquet, MEl Harkani, KBradshaw, CGCleva, CAbla, NDaff, HSchott, OPittet, PAArrighi, JFGaudet, MJohnson, Z Discovery of a Novel Series of CRTH2 (DP2) Receptor Antagonists Devoid of Carboxylic Acids. ACS Med Chem Lett2:938-942 (2011) 
 
Prostaglandin D2 receptor 2
Name:Prostaglandin D2 receptor 2
Type:Enzyme
Mol. Mass.:43295.45
Organism:Homo sapiens (Human)
Description:Q9Y5Y4
Residue:395
BDBM50384516
NameBDBM50384516
Synonyms:CHEMBL2036226
TypeSmall organic molecule
Emp. Form.C25H24FN5O3S
Mol. Mass.493.553
SMILESCc1ccc(CCC(=O)N(Cc2ccc(cc2)S(C)(=O)=O)c2cc(F)cc(c2)-c2nnn[nH]2)cc1