Reaction Details
TargetTyrosine-protein kinase receptor UFO
LigandBDBM50384577
Substrate/Competitorn/a
Meas. Tech.ChEMBL_820660 (CHEMBL2037931)
IC50 57±n/a nM
Citation Liu, JYang, CSimpson, CDeryckere, DVan Deusen, AMiley, MJKireev, DNorris-Drouin, JSather, SHunter, DKorboukh, VKPatel, HSJanzen, WPMachius, MJohnson, GLEarp, HSGraham, DKFrye, SVWang, X Discovery of Novel Small Molecule Mer Kinase Inhibitors for the Treatment of Pediatric Acute Lymphoblastic Leukemia. ACS Med Chem Lett3:129-134 (2012) 
 
Tyrosine-protein kinase receptor UFO
Name:Tyrosine-protein kinase receptor UFO
Type:Enzyme
Mol. Mass.:98316.97
Organism:Homo sapiens (Human)
Description:P30530
Residue:894
BDBM50384577
NameBDBM50384577
Synonyms:CHEMBL2036791 | US9744172, Compound UNC00000489A
TypeSmall organic molecule
Emp. Form.C22H31N9
Mol. Mass.421.5418
SMILESCNc1ncc2c(nn(CC3CCC(N)CC3)c2n1)-c1ccc(nc1)N1CCNCC1