Reaction Details
TargetTyrosine-protein kinase receptor UFO
LigandBDBM50384608
Substrate/Competitorn/a
Meas. Tech.ChEMBL_820660 (CHEMBL2037931)
IC50 38±n/a nM
Citation Liu, JYang, CSimpson, CDeryckere, DVan Deusen, AMiley, MJKireev, DNorris-Drouin, JSather, SHunter, DKorboukh, VKPatel, HSJanzen, WPMachius, MJohnson, GLEarp, HSGraham, DKFrye, SVWang, X Discovery of Novel Small Molecule Mer Kinase Inhibitors for the Treatment of Pediatric Acute Lymphoblastic Leukemia. ACS Med Chem Lett3:129-134 (2012) 
 
Tyrosine-protein kinase receptor UFO
Name:Tyrosine-protein kinase receptor UFO
Type:Enzyme
Mol. Mass.:98316.97
Organism:Homo sapiens (Human)
Description:P30530
Residue:894
BDBM50384608
NameBDBM50384608
Synonyms:CHEMBL2036801 | US9744172, Compound UNC00000471A
TypeSmall organic molecule
Emp. Form.C25H28N6
Mol. Mass.412.53
SMILESNC1CCC(Cn2nc(-c3ccccc3)c3cnc(NCc4ccccc4)nc23)CC1