Reaction Details
TargetTyrosine-protein kinase receptor UFO
LigandBDBM50384610
Substrate/Competitorn/a
Meas. Tech.ChEMBL_820660 (CHEMBL2037931)
IC50 41±n/a nM
Citation Liu, JYang, CSimpson, CDeryckere, DVan Deusen, AMiley, MJKireev, DNorris-Drouin, JSather, SHunter, DKorboukh, VKPatel, HSJanzen, WPMachius, MJohnson, GLEarp, HSGraham, DKFrye, SVWang, X Discovery of Novel Small Molecule Mer Kinase Inhibitors for the Treatment of Pediatric Acute Lymphoblastic Leukemia. ACS Med Chem Lett3:129-134 (2012) 
 
Tyrosine-protein kinase receptor UFO
Name:Tyrosine-protein kinase receptor UFO
Type:Enzyme
Mol. Mass.:98316.97
Organism:Homo sapiens (Human)
Description:P30530
Residue:894
BDBM50384610
NameBDBM50384610
Synonyms:CHEMBL2036803 | US9744172, Compound UNC00000472A
TypeSmall organic molecule
Emp. Form.C26H30N6
Mol. Mass.426.5566
SMILESNC1CCC(Cn2nc(-c3ccccc3)c3cnc(NCCc4ccccc4)nc23)CC1