Reaction Details
TargetTyrosine-protein kinase receptor UFO
LigandBDBM50384576
Substrate/Competitorn/a
Meas. Tech.ChEMBL_820660 (CHEMBL2037931)
IC50 37±n/a nM
Citation Liu, JYang, CSimpson, CDeryckere, DVan Deusen, AMiley, MJKireev, DNorris-Drouin, JSather, SHunter, DKorboukh, VKPatel, HSJanzen, WPMachius, MJohnson, GLEarp, HSGraham, DKFrye, SVWang, X Discovery of Novel Small Molecule Mer Kinase Inhibitors for the Treatment of Pediatric Acute Lymphoblastic Leukemia. ACS Med Chem Lett3:129-134 (2012) 
 
Tyrosine-protein kinase receptor UFO
Name:Tyrosine-protein kinase receptor UFO
Type:Enzyme
Mol. Mass.:98316.97
Organism:Homo sapiens (Human)
Description:P30530
Residue:894
BDBM50384576
NameBDBM50384576
Synonyms:CHEMBL2036808
TypeSmall organic molecule
Emp. Form.C22H29FN6
Mol. Mass.396.5043
SMILESCCCCNc1ncc2c(nn(C[C@H]3CC[C@H](N)CC3)c2n1)-c1ccc(F)cc1