Reaction Details
TargetTyrosine-protein kinase receptor TYRO3
LigandBDBM50384585
Substrate/Competitorn/a
Meas. Tech.ChEMBL_820661 (CHEMBL2037932)
IC50 150±n/a nM
Citation Liu, JYang, CSimpson, CDeryckere, DVan Deusen, AMiley, MJKireev, DNorris-Drouin, JSather, SHunter, DKorboukh, VKPatel, HSJanzen, WPMachius, MJohnson, GLEarp, HSGraham, DKFrye, SVWang, X Discovery of Novel Small Molecule Mer Kinase Inhibitors for the Treatment of Pediatric Acute Lymphoblastic Leukemia. ACS Med Chem Lett3:129-134 (2012) 
 
Tyrosine-protein kinase receptor TYRO3
Name:Tyrosine-protein kinase receptor TYRO3
Type:Protein
Mol. Mass.:96894.13
Organism:Homo sapiens (Human)
Description:Q06418
Residue:890
BDBM50384585
NameBDBM50384585
Synonyms:CHEMBL2036809
TypeSmall organic molecule
Emp. Form.C27H31FN6
Mol. Mass.458.5736
SMILESN[C@H]1CC[C@H](Cn2nc(-c3ccc(F)cc3)c3cnc(NCCCc4ccccc4)nc23)CC1