Reaction Details
TargetTyrosine-protein kinase Mer
LigandBDBM50384594
Substrate/Competitorn/a
Meas. Tech.ChEMBL_820659 (CHEMBL2037930)
IC50 25±n/a nM
Citation Liu, JYang, CSimpson, CDeryckere, DVan Deusen, AMiley, MJKireev, DNorris-Drouin, JSather, SHunter, DKorboukh, VKPatel, HSJanzen, WPMachius, MJohnson, GLEarp, HSGraham, DKFrye, SVWang, X Discovery of Novel Small Molecule Mer Kinase Inhibitors for the Treatment of Pediatric Acute Lymphoblastic Leukemia. ACS Med Chem Lett3:129-134 (2012) 
 
Tyrosine-protein kinase Mer
Name:Tyrosine-protein kinase Mer
Type:PROTEIN
Mol. Mass.:110234.77
Organism:Homo sapiens (Human)
Description:ChEMBL_1498723
Residue:999
BDBM50384594
NameBDBM50384594
Synonyms:CHEMBL2036630 | US9744172, Compound UNC00000356A
TypeSmall organic molecule
Emp. Form.C20H26N6O
Mol. Mass.366.46
SMILESCNc1ncc2c(nn(CC3CCC(N)CC3)c2n1)-c1ccc(OC)cc1