Reaction Details
TargetTyrosine-protein kinase Mer
LigandBDBM50384609
Substrate/Competitorn/a
Meas. Tech.ChEMBL_820659 (CHEMBL2037930)
IC50 10±n/a nM
Citation Liu, JYang, CSimpson, CDeryckere, DVan Deusen, AMiley, MJKireev, DNorris-Drouin, JSather, SHunter, DKorboukh, VKPatel, HSJanzen, WPMachius, MJohnson, GLEarp, HSGraham, DKFrye, SVWang, X Discovery of Novel Small Molecule Mer Kinase Inhibitors for the Treatment of Pediatric Acute Lymphoblastic Leukemia. ACS Med Chem Lett3:129-134 (2012) 
 
Tyrosine-protein kinase Mer
Name:Tyrosine-protein kinase Mer
Type:PROTEIN
Mol. Mass.:110234.77
Organism:Homo sapiens (Human)
Description:ChEMBL_1498723
Residue:999
BDBM50384609
NameBDBM50384609
Synonyms:CHEMBL2036802 | US9744172, Compound UNC00000546A
TypeSmall organic molecule
Emp. Form.C26H30N6O
Mol. Mass.442.556
SMILESCOc1ccc(CNc2ncc3c(nn(CC4CCC(N)CC4)c3n2)-c2ccccc2)cc1