Reaction Details
TargetHydroxycarboxylic acid receptor 2
LigandBDBM50384641
Substrate/Competitorn/a
Meas. Tech.ChEMBL_820675 (CHEMBL2037946)
EC50 2±n/a nM
Citation Palani, ARao, AUChen, XHuang, XSu, JTang, HHuang, YQin, JXiao, DDegrado, SSofolarides, MZhu, XLiu, ZMcKittrick, BZhou, WAslanian, RGreenlee, WJSenior, MCheewatrakoolpong, BZhang, HFarley, CCook, JKurowski, SLi, Qvan Heek, MWang, GHsieh, YLi, FGreenfeder, SChintala, M Discovery of SCH 900271, a Potent Nicotinic Acid Receptor Agonist for the Treatment of Dyslipidemia. ACS Med Chem Lett3:63-68 (2012) 
 
Hydroxycarboxylic acid receptor 2
Name:Hydroxycarboxylic acid receptor 2
Type:PROTEIN
Mol. Mass.:41476.06
Organism:Rattus norvegicus
Description:ChEMBL_820675
Residue:360
BDBM50384641
NameBDBM50384641
Synonyms:CHEMBL2036955
TypeSmall organic molecule
Emp. Form.C13H14N2O4
Mol. Mass.262.2613
SMILESO=c1cc(CCCC2CC2)c2c([nH]c(=O)[nH]c2=O)o1