Reaction Details
TargetHydroxycarboxylic acid receptor 2
LigandBDBM50384612
Substrate/Competitorn/a
Meas. Tech.ChEMBL_820675 (CHEMBL2037946)
EC50 8±n/a nM
Citation Palani, ARao, AUChen, XHuang, XSu, JTang, HHuang, YQin, JXiao, DDegrado, SSofolarides, MZhu, XLiu, ZMcKittrick, BZhou, WAslanian, RGreenlee, WJSenior, MCheewatrakoolpong, BZhang, HFarley, CCook, JKurowski, SLi, Qvan Heek, MWang, GHsieh, YLi, FGreenfeder, SChintala, M Discovery of SCH 900271, a Potent Nicotinic Acid Receptor Agonist for the Treatment of Dyslipidemia. ACS Med Chem Lett3:63-68 (2012) 
 
Hydroxycarboxylic acid receptor 2
Name:Hydroxycarboxylic acid receptor 2
Type:PROTEIN
Mol. Mass.:41476.06
Organism:Rattus norvegicus
Description:ChEMBL_820675
Residue:360
BDBM50384612
NameBDBM50384612
Synonyms:CHEMBL2036958
TypeSmall organic molecule
Emp. Form.C14H16N2O4
Mol. Mass.276.2878
SMILESCC1(CCCc2cc(=O)oc3[nH]c(=O)[nH]c(=O)c23)CC1