Reaction Details
TargetPlatelet-derived growth factor receptor beta
LigandBDBM50384721
Substrate/Competitorn/a
Meas. Tech.ChEMBL_820940 (CHEMBL2038985)
IC50 120±n/a nM
Citation Albaugh, PFan, YMi, YSun, FAdrian, FLi, NJia, YSarkisova, YKreusch, AHood, TLu, MLiu, GHuang, SLiu, ZLoren, JTuntland, TKaranewsky, DSSeidel, HMMolteni, V Discovery of GNF-5837, a Selective TRK Inhibitor with Efficacy in Rodent Cancer Tumor Models. ACS Med Chem Lett3:140-145 (2012) 
 
Platelet-derived growth factor receptor beta
Name:Platelet-derived growth factor receptor beta
Type:Enzyme
Mol. Mass.:122771.00
Organism:Mus musculus (mouse)
Description:P05622
Residue:1098
BDBM50384721
NameBDBM50384721
Synonyms:CHEMBL2037224
TypeSmall organic molecule
Emp. Form.C27H20F3N5O2
Mol. Mass.503.4752
SMILESFC(F)(F)c1cccc(NC(=O)Nc2cccc(Nc3ccc4\C(=C\c5ccc[nH]5)C(=O)Nc4c3)c2)c1