Reaction Details
TargetEphrin type-B receptor 2
LigandBDBM50384721
Substrate/Competitorn/a
Meas. Tech.ChEMBL_820927 (CHEMBL2038868)
IC50 1700±n/a nM
Citation Albaugh, PFan, YMi, YSun, FAdrian, FLi, NJia, YSarkisova, YKreusch, AHood, TLu, MLiu, GHuang, SLiu, ZLoren, JTuntland, TKaranewsky, DSSeidel, HMMolteni, V Discovery of GNF-5837, a Selective TRK Inhibitor with Efficacy in Rodent Cancer Tumor Models. ACS Med Chem Lett3:140-145 (2012) 
 
Ephrin type-B receptor 2
Name:Ephrin type-B receptor 2
Type:PROTEIN
Mol. Mass.:109887.41
Organism:Mus musculus
Description:ChEMBL_101390
Residue:986
BDBM50384721
NameBDBM50384721
Synonyms:CHEMBL2037224
TypeSmall organic molecule
Emp. Form.C27H20F3N5O2
Mol. Mass.503.4752
SMILESFC(F)(F)c1cccc(NC(=O)Nc2cccc(Nc3ccc4\C(=C\c5ccc[nH]5)C(=O)Nc4c3)c2)c1