Reaction Details
TargetBDNF/NT-3 growth factors receptor
LigandBDBM50384722
Substrate/Competitorn/a
Meas. Tech.ChEMBL_820920 (CHEMBL2038861)
IC50 15±n/a nM
Citation Albaugh, PFan, YMi, YSun, FAdrian, FLi, NJia, YSarkisova, YKreusch, AHood, TLu, MLiu, GHuang, SLiu, ZLoren, JTuntland, TKaranewsky, DSSeidel, HMMolteni, V Discovery of GNF-5837, a Selective TRK Inhibitor with Efficacy in Rodent Cancer Tumor Models. ACS Med Chem Lett3:140-145 (2012) 
 
BDNF/NT-3 growth factors receptor
Name:BDNF/NT-3 growth factors receptor
Type:Enzyme
Mol. Mass.:91996.87
Organism:Homo sapiens (Human)
Description:Q16620
Residue:822
BDBM50384722
NameBDBM50384722
Synonyms:CHEMBL2037223
TypeSmall organic molecule
Emp. Form.C40H45F3N8O3
Mol. Mass.742.8323
SMILESCN(C)CCCNC(=O)c1c(C)[nH]c(\C=C2/C(=O)Nc3cc(Nc4cccc(NC(=O)c5cc(cc(c5)C(F)(F)F)N5CCN(C)CC5)c4)ccc23)c1C