Reaction Details
TargetBDNF/NT-3 growth factors receptor
LigandBDBM50384731
Substrate/Competitorn/a
Meas. Tech.ChEMBL_820920 (CHEMBL2038861)
IC50 35±n/a nM
Citation Albaugh, PFan, YMi, YSun, FAdrian, FLi, NJia, YSarkisova, YKreusch, AHood, TLu, MLiu, GHuang, SLiu, ZLoren, JTuntland, TKaranewsky, DSSeidel, HMMolteni, V Discovery of GNF-5837, a Selective TRK Inhibitor with Efficacy in Rodent Cancer Tumor Models. ACS Med Chem Lett3:140-145 (2012) 
 
BDNF/NT-3 growth factors receptor
Name:BDNF/NT-3 growth factors receptor
Type:Enzyme
Mol. Mass.:91996.87
Organism:Homo sapiens (Human)
Description:Q16620
Residue:822
BDBM50384731
NameBDBM50384731
Synonyms:CHEMBL2037214
TypeSmall organic molecule
Emp. Form.C33H31F3N6O3
Mol. Mass.616.6328
SMILESOCCN1CCN(CC1)c1cc(cc(c1)C(F)(F)F)C(=O)Nc1cccc(Nc2ccc3\C(=C\c4ccc[nH]4)C(=O)Nc3c2)c1