Reaction Details
TargetHigh affinity nerve growth factor receptor
LigandBDBM50384732
Substrate/Competitorn/a
Meas. Tech.ChEMBL_820919 (CHEMBL2038860)
IC50 3±n/a nM
Citation Albaugh, PFan, YMi, YSun, FAdrian, FLi, NJia, YSarkisova, YKreusch, AHood, TLu, MLiu, GHuang, SLiu, ZLoren, JTuntland, TKaranewsky, DSSeidel, HMMolteni, V Discovery of GNF-5837, a Selective TRK Inhibitor with Efficacy in Rodent Cancer Tumor Models. ACS Med Chem Lett3:140-145 (2012) 
 
High affinity nerve growth factor receptor
Name:High affinity nerve growth factor receptor
Type:n/a
Mol. Mass.:87498.18
Organism:Homo sapiens (Human)
Description:P04629
Residue:796
BDBM50384732
NameBDBM50384732
Synonyms:CHEMBL2037213
TypeSmall organic molecule
Emp. Form.C32H28F3N5O3
Mol. Mass.587.5916
SMILESOC1CCN(CC1)c1cc(cc(c1)C(F)(F)F)C(=O)Nc1cccc(Nc2ccc3\C(=C\c4ccc[nH]4)C(=O)Nc3c2)c1